Reaction Details
TargetBeta-2 adrenergic receptor
LigandBDBM25756
Substrate/Competitorn/a
Ki 1698.24±n/a nM
CommentsPDSP_3087
Citation Tsuchihashi, HNakashima, YKinami, JNagatomo, T Characteristics of 125I-iodocyanopindolol binding to beta-adrenergic and serotonin-1B receptors of rat brain: selectivity of beta-adrenergic agents. Jpn J Pharmacol52:195-200 (1990) 
 
Beta-2 adrenergic receptor
Name:Beta-2 adrenergic receptor
Type:PROTEIN
Mol. Mass.:46896.26
Organism:Rattus norvegicus
Description:ChEMBL_38603
Residue:418
BDBM25756
NameBDBM25756
Synonyms:(2R,3R)-2,3-dihydroxysuccinic acid;1-(isopropylamino)-3-[4-(2-methoxyethyl)phenoxy]propan-2-ol CHEMBL13 Spesicor metoprolol tartrate | {2-hydroxy-3-[4-(2-methoxyethyl)phenoxy]propyl}(propan-2-yl)amine
TypeSmall organic molecule
Emp. Form.C15H25NO3
Mol. Mass.267.3639
SMILESCOCCc1ccc(OCC(O)CNC(C)C)cc1