Reaction Details
TargetD(2) dopamine receptor
LigandBDBM21397
Substrate/Competitorn/a
Ki 0.06±n/a nM
CommentsPDSP_1739
Citation Sokoloff, PGiros, BMartres, MPBouthenet, MLSchwartz, JC Molecular cloning and characterization of a novel dopamine receptor (D3) as a target for neuroleptics. Nature347:146-51 (1990) 
 
D(2) dopamine receptor
Name:D(2) dopamine receptor
Type:G Protein-Coupled Receptor (GPCR)
Mol. Mass.:50931.60
Organism:Rattus norvegicus (rat)
Description:P61169
Residue:444
BDBM21397
NameBDBM21397
Synonyms:8-[4-(4-fluorophenyl)-4-keto-butyl]-1-phenyl-1,3,8-triazaspiro[4.5]decan-4-one 8-[4-(4-fluorophenyl)-4-oxobutyl]-1-phenyl-1,3,8-triazaspiro[4.5]decan-4-one MLS000028615 SPIPERONE US9359372, Spiperone cid_5265
Typeradiolabeled ligand
Emp. Form.C23H26FN3O2
Mol. Mass.395.4698
SMILESFc1ccc(cc1)C(=O)CCCN1CCC2(CC1)N(CNC2=O)c1ccccc1