Reaction Details
TargetD(3) dopamine receptor
LigandBDBM50028421
Substrate/Competitorn/a
Ki 0.62±n/a nM
CommentsPDSP_1453
Citation Sokoloff, PGiros, BMartres, MPBouthenet, MLSchwartz, JC Molecular cloning and characterization of a novel dopamine receptor (D3) as a target for neuroleptics. Nature347:146-51 (1990) 
 
D(3) dopamine receptor
Name:D(3) dopamine receptor
Type:Protein
Mol. Mass.:49540.58
Organism:Rattus norvegicus (Rat)
Description:P19020
Residue:446
BDBM50028421
NameBDBM50028421
Synonyms:9-Methylsulfanylmethyl-7-propyl-4,6,6a,7,8,9,10,10a-octahydro-indolo[4,3-fg]quinoline; compound with methanesulfonic acid LY-127809 Pergolide | Permax
TypeSmall organic molecule
Emp. Form.C19H26N2S
Mol. Mass.314.488
SMILESCCCN1C[C@H](CSC)C[C@H]2[C@H]1Cc1c[nH]c3cccc2c13