Reaction Details
TargetNicotinic acetylcholine receptor
LigandBDBM50004656
Substrate/Competitorn/a
Ki 600±n/a nM
CommentsPDSP_467
Citation Pabreza, LADhawan, SKellar, KJ [3H]cytisine binding to nicotinic cholinergic receptors in brain. Mol Pharmacol39:9-12 (1991) Nicotinic acetylcholine receptor
Name:Nicotinic acetylcholine receptor
Type:Enzyme Catalytic Domain
Mol. Mass.:2478.99
Organism:RAT
Description:n-AChR 0 RAT::Q62594
Residue:23
BDBM50004656
NameBDBM50004656
Synonyms:(2-Carbamoyloxy-ethyl)-trimethyl-ammonium (2-Hydroxyethyl)trimethyl ammonium chloride carbamate (carbachol)(2-Carbamoyloxy-ethyl)-trimethyl-ammonium 2-((Aminocarbonyl)oxy)-N,N,N-trimethylethanaminum chloride 2-(carbamoyloxy)-N,N,N-trimethylethanaminium chloride CARBASTAT Carbachol chloride Choline carbamate chloride Choline chlorine carbamate Karbamoylcholin chlorid | MIOSTAT
TypeSmall organic molecule
Emp. Form.C6H15N2O2
Mol. Mass.147.195
SMILESC[N+](C)(C)CCOC(N)=O