Reaction Details
TargetMuscarinic acetylcholine receptor M3
LigandBDBM50176065
Substrate/Competitorn/a
Ki 0.52±n/a nM
CommentsPDSP_111
Citation Dörje, FWess, JLambrecht, GTacke, RMutschler, EBrann, MR Antagonist binding profiles of five cloned human muscarinic receptor subtypes. J Pharmacol Exp Ther256:727-33 (1991) Muscarinic acetylcholine receptor M3
Name:Muscarinic acetylcholine receptor M3
Type:Enzyme
Mol. Mass.:66151.03
Organism:Homo sapiens (Human)
Description:P20309
Residue:590
BDBM50176065
NameBDBM50176065
Synonyms:4-DAMP Acetic acid 4-[(4-acetoxy-phenyl)-pyridin-2-yl-methyl]-phenyl ester CHEMBL76897
TypeSmall organic molecule
Emp. Form.C21H26NO2
Mol. Mass.324.4361
SMILESC[N+]1(C)CCC(CC1)OC(=O)C(c1ccccc1)c1ccccc1