Reaction Details
TargetMuscarinic acetylcholine receptor M3
LigandBDBM50071173
Substrate/Competitorn/a
Ki 93.33±n/a nM
CommentsPDSP_933
Citation Dörje, FWess, JLambrecht, GTacke, RMutschler, EBrann, MR Antagonist binding profiles of five cloned human muscarinic receptor subtypes. J Pharmacol Exp Ther256:727-33 (1991) Muscarinic acetylcholine receptor M3
Name:Muscarinic acetylcholine receptor M3
Type:Enzyme
Mol. Mass.:66151.03
Organism:Homo sapiens (Human)
Description:P20309
Residue:590
BDBM50071173
NameBDBM50071173
Synonyms:(3R,4R,4aS,8aR)-4-[(E)-2-((2S,6S)-1,6-Dimethyl-piperidin-2-yl)-vinyl]-3-methyl-decahydro-naphtho[2,3-c]furan-1-one HIMBACINE
TypeSmall organic molecule
Emp. Form.C22H35NO2
Mol. Mass.345.5188
SMILESC[C@H]1OC(=O)C2C[C@H]3CCCC[C@@H]3[C@@H](\C=C\[C@@H]3CCC[C@H](C)N3C)C12