Reaction Details
TargetCarboxypeptidase B
LigandBDBM81905
Substrate/Competitorn/a
Meas. Tech.Inhibition Assay
Ki 4.1e+3±n/a nM
Citation Fernández, DAvilés, FXVendrell, J Aromatic organic compounds as scaffolds for metallocarboxypeptidase inhibitor design. Chem Biol Drug Des73:75-82 (2009) 
 
Carboxypeptidase B
Name:Carboxypeptidase B
Synonyms:CPB
Type:Enzyme
Mol. Mass.:48382.46
Organism:Helicoverpa zea (Corn earworm moth) (Heliothis zea)
Description:Q3T905
Residue:429
BDBM81905
NameBDBM81905
Synonyms:1-(3,4-dihydroisoquinolin-1(1H)-yl)-2-(5-(3,5-dimethylphenyl)-1,3,4-oxadiazol-2-ylthio)ethanone, 4
TypeSmall organic molecule
Emp. Form.C21H21N3O2S
Mol. Mass.379.475
SMILESCc1cc(C)cc(c1)-c1nnc(SCC(=O)N2CCCc3ccccc23)o1