Reaction Details
TargetAdenosine receptor A3
LigandBDBM81925
Substrate/Competitorn/a
Ki 2.9±n/a nM
CommentsPDSP_2952
Citation Klotz, KNVogt, HTawfik-Schlieper, H Comparison of A1 adenosine receptors in brain from different species by radioligand binding and photoaffinity labelling. Naunyn Schmiedebergs Arch Pharmacol343:196-201 (1991) 
 
Adenosine receptor A3
Name:Adenosine receptor A3
Type:Enzyme Catalytic Domain
Mol. Mass.:36152.74
Organism:Sheep
Description:ADENOSINE A1 ADORA1 Sheep::P35342
Residue:317
BDBM81925
NameBDBM81925
Synonyms:8-Cyclopentyl-1,3-dimethyl-3,7-dihydro-purine-2,6-dione CAS_1917 CPT | NSC_1917
TypeSmall organic molecule
Emp. Form.C12H16N4O2
Mol. Mass.248.281
SMILESCn1c2nc([nH]c2c(=O)n(C)c1=O)C1CCCC1