Reaction Details
TargetD(1A) dopamine receptor
LigandBDBM81927
Substrate/Competitorn/a
Ki 0.29±n/a nM
CommentsPDSP_1491
Citation Simonneaux, VMurrin, LCEbadi, M Characterization of D1 dopamine receptors in the bovine pineal gland with [3H]SCH 23390. J Pharmacol Exp Ther253:214-20 (1990) D(1A) dopamine receptor
Name:D(1A) dopamine receptor
Type:Enzyme Catalytic Domain
Mol. Mass.:49330.65
Organism:BOVINE
Description:DOPAMINE D1 DRD1 BOVINE::Q95136
Residue:446
BDBM81927
NameBDBM81927
Synonyms:CAS_60756-96-9 Pifluthixol
TypeSmall organic molecule
Emp. Form.C24H25F4NOS
Mol. Mass.451.52
SMILESOCCC1CCN(CC\C=C2\c3ccc(F)cc3Sc3ccc(cc23)C(F)(F)F)CC1