Reaction Details
TargetPlatelet-activating factor receptor
LigandBDBM81928
Substrate/Competitorn/a
Ki 9±n/a nM
CommentsPDSP_1614
Citation Tahraoui, LFloch, ACavero, I Functional validation of platelet-activating factor receptor sites characterized biochemically by a specific and reproducible [3H]platelet-activating factor binding in human platelets. J Pharmacol Exp Ther252:1221-7 (1990) Platelet-activating factor receptor
Name:Platelet-activating factor receptor
Type:Enzyme Catalytic Domain
Mol. Mass.:39219.60
Organism:Homo sapiens (Human)
Description:PAF Platelet activating factor PTAFR HUMAN::P25105
Residue:342
BDBM81928
NameBDBM81928
Synonyms:1H,3H-Pyrrolo[1,2-c]thiazole-7-carboxamide,N-(3-benzoylphenyl)-3-(3-pyridinyl)- RP 58467
TypeSmall organic molecule
Emp. Form.C25H19N3O2S
Mol. Mass.425.502
SMILESO=C(Nc1ccc(cc1)C(=O)c1ccccc1)c1ccn2C(SCc12)c1cccnc1