Reaction Details
TargetPlatelet-activating factor receptor
LigandBDBM50001765
Substrate/Competitorn/a
Ki 2492±n/a nM
CommentsPDSP_1906
Citation Tahraoui, LFloch, ACavero, I Functional validation of platelet-activating factor receptor sites characterized biochemically by a specific and reproducible [3H]platelet-activating factor binding in human platelets. J Pharmacol Exp Ther252:1221-7 (1990) Platelet-activating factor receptor
Name:Platelet-activating factor receptor
Type:Enzyme Catalytic Domain
Mol. Mass.:39219.60
Organism:Homo sapiens (Human)
Description:PAF Platelet activating factor PTAFR HUMAN::P25105
Residue:342
BDBM50001765
NameBDBM50001765
Synonyms:8-chloro-6-(2-chlorophenyl)-1-methyl-4H-[1,2,4]triazolo[4,3-a][1,4]benzodiazepine Halcion | TRIAZOLAM
TypeSmall organic molecule
Emp. Form.C17H12Cl2N4
Mol. Mass.343.21
SMILESCc1nnc2CN=C(c3ccccc3Cl)c3cc(Cl)ccc3-n12