Reaction Details
TargetHrh3 protein
LigandBDBM22889
Substrate/Competitorn/a
Ki 8000±n/a nM
CommentsPDSP_519
Citation West, REZweig, AGranzow, RTSiegel, MIEgan, RW Biexponential kinetics of (R)-alpha-[3H]methylhistamine binding to the rat brain H3 histamine receptor. J Neurochem55:1612-6 (1990) 
 
Hrh3 protein
Name:Hrh3 protein
Type:Enzyme Catalytic Domain
Mol. Mass.:37860.96
Organism:RAT
Description:Q5PPG3
Residue:344
BDBM22889
NameBDBM22889
Synonyms:(Cimetidine) N-Methyl-N''''-[2-(5-methyl-1H-imidazol-4-ylmethylsulfanyl)-ethyl]-guanidine,cyanide (cimetidine) N-methyl-N-[2-(5-methyl-1H-4-imidazolylmethylsulfanyl)ethyl]cyanoiminomethanediamine 1-cyano-2-methyl-3-(2-{[(5-methyl-1H-imidazol-4-yl)methyl]sulfanyl}ethyl)guanidine 2-Methyl-8-phenethyl-imidazo[1,2-a]pyridine-3-carboxylic acid methyl ester(cimetidine) 2-methylamino-2-[2-(5-methyl-1H-4-imidazolylmethylsulfanyl)ethylamino]-(Z)-1-imino cyanide(cimetidine) CHEMBL30 Eureceptor N''''''''-cyano-N-methyl-N''''-(2-{[(5-methyl-1H-imidazol-4-yl)methyl]-lambda~4~-sulfanyl}ethyl)guanidine N''''''''-cyano-N-methyl-N''''-(2-{[(5-methyl-1H-imidazol-4-yl)methyl]thio}ethyl)guanidine (Cimetidine) N''''''''-cyano-N-methyl-N''''-({[(5-methyl-1H-imidazol-4-yl)methyl]thio}methyl)guanidine(cimetidine) N-Methyl-N''''-[2-(5-methyl-1H-imidazol-4-ylmethylsulfanyl)-ethyl]-N''''''''-Cyano-guanidine N-Methyl-N''''-[2-(5-methyl-1H-imidazol-4-ylmethylsulfanyl)-ethyl]-cyanoguanidine(cimetidine) N-methyl-N''''-cyano-N''''''''-[2-(5-methyl-1H-imidazol-4-ylmethylsulfanyl)-ethyl]-guanidine N-methyl-N-[2-(5-methyl-1H-4-imidazolylmethylsulfanyl)ethyl]cyanoiminomethanediamine (cimetidine) N-tert-Butyl-N''''-[4-(1H-imidazol-4-yl)-phenyl]-formamidine(cimetidine) Tagamet HB cemitidine
TypeSmall organic molecule
Emp. Form.C10H16N6S
Mol. Mass.252.339
SMILESCNC(NC#N)=NCCSCc1[nH]cnc1C