Reaction Details
TargetHrh3 protein
LigandBDBM7882
Substrate/Competitorn/a
Ki>10000±n/a nM
CommentsPDSP_970
Citation West, REZweig, AGranzow, RTSiegel, MIEgan, RW Biexponential kinetics of (R)-alpha-[3H]methylhistamine binding to the rat brain H3 histamine receptor. J Neurochem55:1612-6 (1990) 
 
Hrh3 protein
Name:Hrh3 protein
Type:Enzyme Catalytic Domain
Mol. Mass.:37860.96
Organism:RAT
Description:Q5PPG3
Residue:344
BDBM7882
NameBDBM7882
Synonyms:1H-imidazole Imidazole (Im) US9144538, Imidazole | imidazole
TypeSmall organic molecule
Emp. Form.C3H4N2
Mol. Mass.68.0773
SMILESc1c[nH]cn1