Reaction Details
TargetHrh3 protein
LigandBDBM81468
Substrate/Competitorn/a
Ki>10000±n/a nM
CommentsPDSP_1231
Citation West, REZweig, AGranzow, RTSiegel, MIEgan, RW Biexponential kinetics of (R)-alpha-[3H]methylhistamine binding to the rat brain H3 histamine receptor. J Neurochem55:1612-6 (1990) 
 
Hrh3 protein
Name:Hrh3 protein
Type:Enzyme Catalytic Domain
Mol. Mass.:37860.96
Organism:RAT
Description:Q5PPG3
Residue:344
BDBM81468
NameBDBM81468
Synonyms:CAS_34839-70-8 NSC_1548992
TypeSmall organic molecule
Emp. Form.C9H16N4S2
Mol. Mass.244.38
SMILESCNC(=S)NCCSCc1[nH]cnc1C