Reaction Details
TargetHrh3 protein
LigandBDBM22904
Substrate/Competitorn/a
Ki 1.2±n/a nM
CommentsPDSP_1585
Citation West, REZweig, AGranzow, RTSiegel, MIEgan, RW Biexponential kinetics of (R)-alpha-[3H]methylhistamine binding to the rat brain H3 histamine receptor. J Neurochem55:1612-6 (1990) 
 
Hrh3 protein
Name:Hrh3 protein
Type:Enzyme Catalytic Domain
Mol. Mass.:37860.96
Organism:RAT
Description:Q5PPG3
Residue:344
BDBM22904
NameBDBM22904
Synonyms:(2R)-1-(1H-imidazol-5-yl)propan-2-amine Alpha-Methylhistamine-R CHEMBL268229 RAMH
TypeSmall organic molecule
Emp. Form.C6H11N3
Mol. Mass.125.1716
SMILESC[C@@H](N)Cc1cnc[nH]1