Reaction Details
TargetVoltage-dependent L-type calcium channel subunit alpha-1C
LigandBDBM81768
Substrate/Competitorn/a
Ki 9000±n/a nM
CommentsPDSP_2042
Citation Zobrist, RHMecca, TE [3H]TA-3090, a selective benzothiazepine-type calcium channel receptor antagonist: in vitro characterization. J Pharmacol Exp Ther253:461-5 (1990) Voltage-dependent L-type calcium channel subunit alpha-1C
Name:Voltage-dependent L-type calcium channel subunit alpha-1C
Type:Enzyme Catalytic Domain
Mol. Mass.:243492.26
Organism:RAT
Description:Calcium channel 0 RAT::P22002
Residue:2169
BDBM81768
NameBDBM81768
Synonyms:BENZYLIC ACID NSC_5311391 | Quinuclidinyl benzilate
TypeSmall organic molecule
Emp. Form.C14H12O3
Mol. Mass.228.2433
SMILESOC(=O)C(O)(c1ccccc1)c1ccccc1