Reaction Details
TargetMuscarinic acetylcholine receptor M3
LigandBDBM81799
Substrate/Competitorn/a
Ki 50±n/a nM
CommentsPDSP_932
Citation Waelbroeck, MTastenoy, MCamus, JChristophe, J Binding of selective antagonists to four muscarinic receptors (M1 to M4) in rat forebrain. Mol Pharmacol38:267-73 (1990) Muscarinic acetylcholine receptor M3
Name:Muscarinic acetylcholine receptor M3
Type:Enzyme Catalytic Domain
Mol. Mass.:66086.66
Organism:RAT
Description:Cholinergic, muscarinic M3 CHRM3 RAT::P08483
Residue:589
BDBM81799
NameBDBM81799
Synonyms:CAS_98299-40-2 NSC_3602 | hexahydrosiladifenidol
TypeSmall organic molecule
Emp. Form.C20H33NOSi
Mol. Mass.331.5676
SMILESO[Si](CCCN1CCCCC1)(C1CCCCC1)c1ccccc1