Reaction Details
TargetMuscarinic acetylcholine receptor M4
LigandBDBM50018056
Substrate/Competitorn/a
Ki 1700±n/a nM
CommentsPDSP_246
Citation Waelbroeck, MTastenoy, MCamus, JChristophe, J Binding of selective antagonists to four muscarinic receptors (M1 to M4) in rat forebrain. Mol Pharmacol38:267-73 (1990) Muscarinic acetylcholine receptor M4
Name:Muscarinic acetylcholine receptor M4
Type:Enzyme Catalytic Domain
Mol. Mass.:52841.70
Organism:RAT
Description:Cholinergic, muscarinic M4 CHRM4 RAT::P08485
Residue:477
BDBM50018056
NameBDBM50018056
Synonyms:(AF-DX 116) 11-[2-(2-Diethylaminomethyl-piperidin-1-yl)-acetyl]-5,11-dihydro-benzo[e]pyrido[3,2-b][1,4]diazepin-6-one 2-Diethylaminomethyl-1-[2-oxo-2-(6-oxo-5,6-dihydro-benzo[e]pyrido[3,2-b][1,4]diazepin-11-yl)-ethyl]-piperidinium AF-DX 116 CHEMBL17045 | Otenzepad
TypeSmall organic molecule
Emp. Form.C24H31N5O2
Mol. Mass.421.5352
SMILESCCN(CC)CC1CCCCN1CC(=O)N1c2ccccc2C(=O)Nc2cccnc12