Reaction Details
TargetAlpha-1A adrenergic receptor
LigandBDBM81946
Substrate/Competitorn/a
Ki 740±n/a nM
CommentsPDSP_1121
Citation Hyttel, JLarsen, JJ Neurochemical profile of Lu 19-005, a potent inhibitor of uptake of dopamine, noradrenaline, and serotonin. J Neurochem44:1615-22 (1985) 
 
Alpha-1A adrenergic receptor
Name:Alpha-1A adrenergic receptor
Type:Protein
Mol. Mass.:51620.15
Organism:Rattus norvegicus (Rat)
Description:P43140
Residue:466
BDBM81946
NameBDBM81946
Synonyms:CAS_96850-13-4 LU 19-005
TypeSmall organic molecule
Emp. Form.C16H15Cl2N
Mol. Mass.292.203
SMILESCN[C@H]1C[C@@H](c2ccccc12)c1ccc(Cl)c(Cl)c1