Reaction Details
TargetAlpha-1A adrenergic receptor
LigandBDBM22417
Substrate/Competitorn/a
Ki 4300±n/a nM
CommentsPDSP_1329
Citation Hyttel, JLarsen, JJ Neurochemical profile of Lu 19-005, a potent inhibitor of uptake of dopamine, noradrenaline, and serotonin. J Neurochem44:1615-22 (1985) 
 
Alpha-1A adrenergic receptor
Name:Alpha-1A adrenergic receptor
Type:Protein
Mol. Mass.:51620.15
Organism:Rattus norvegicus (Rat)
Description:P43140
Residue:466
BDBM22417
NameBDBM22417
Synonyms:3-(2-methoxyphenoxy)-N-methyl-3-phenylpropan-1-amine LY 135252 LY135252 Nisoxetine US9944618, Compound ID No. 177 [3H]Nisoxetine
Typeradiolabeled ligand
Emp. Form.C17H21NO2
Mol. Mass.271.3541
SMILESCNCCC(Oc1ccccc1OC)c1ccccc1