Reaction Details
TargetMuscarinic acetylcholine receptor M2
LigandBDBM50010101
Substrate/Competitorn/a
Ki 244±n/a nM
CommentsPDSP_3900
Citation Buckley, NJBonner, TIBuckley, CMBrann, MR Antagonist binding properties of five cloned muscarinic receptors expressed in CHO-K1 cells. Mol Pharmacol35:469-76 (1989) Muscarinic acetylcholine receptor M2
Name:Muscarinic acetylcholine receptor M2
Type:GPCR
Mol. Mass.:51730.61
Organism:Homo sapiens (Human)
Description:P08172
Residue:466
BDBM50010101
NameBDBM50010101
Synonyms:2-(diethylamino)ethyl 1-cyclohexylcyclohexanecarboxylate Bicyclohexyl-1-carboxylic acid 2-diethylamino-ethyl ester DICYCLOMINE | Dicycloverin
TypeSmall organic molecule
Emp. Form.C19H35NO2
Mol. Mass.309.4867
SMILESCCN(CC)CCOC(=O)C1(CCCCC1)C1CCCCC1