Reaction Details
Target5-hydroxytryptamine receptor 2A
LigandBDBM30707
Substrate/Competitorn/a
Ki 14±n/a nM
CommentsPDSP_695
Citation McKenna, DJPeroutka, SJ Differentiation of 5-hydroxytryptamine2 receptor subtypes using 125I-R-(-)2,5-dimethoxy-4-iodo-phenylisopropylamine and 3H-ketanserin. J Neurosci9:3482-90 (1989) 5-hydroxytryptamine receptor 2A
Name:5-hydroxytryptamine receptor 2A
Type:G Protein-Coupled Receptor (GPCR)
Mol. Mass.:52852.05
Organism:Rattus norvegicus (rat)
Description:Rat cortex membranes 5-HT2A receptors.
Residue:471
BDBM30707
NameBDBM30707
Synonyms:2-(5-methoxy-1H-indol-3-yl)-N,N-dimethyl-ethanamine 2-(5-methoxy-1H-indol-3-yl)ethyl-dimethyl-amine CHEMBL7257 Methoxydimethyltryptamines WO2023019367, Compound 5-MeO-DMT | cid_1832
TypeSmall organic molecule
Emp. Form.C13H18N2O
Mol. Mass.218.2948
SMILESCOc1ccc2[nH]cc(CCN(C)C)c2c1