Reaction Details
Target5-hydroxytryptamine receptor 2B
LigandBDBM50014407
Substrate/Competitorn/a
Ki 460±n/a nM
CommentsPDSP_1578
Citation McKenna, DJPeroutka, SJ Differentiation of 5-hydroxytryptamine2 receptor subtypes using 125I-R-(-)2,5-dimethoxy-4-iodo-phenylisopropylamine and 3H-ketanserin. J Neurosci9:3482-90 (1989) 5-hydroxytryptamine receptor 2B
Name:5-hydroxytryptamine receptor 2B
Type:Enzyme Catalytic Domain
Mol. Mass.:15564.62
Organism:BOVINE
Description:Q8MI09
Residue:137
BDBM50014407
NameBDBM50014407
Synonyms:2-(piperazin-1-yl)quinoline 2-Piperazin-1-yl-quinoline (Quipazine) CHEMBL18772 | QUIPAZINE
TypeSmall organic molecule
Emp. Form.C13H15N3
Mol. Mass.213.2783
SMILESC1CN(CCN1)c1ccc2ccccc2n1