Reaction Details
TargetAdenosine receptor A1
LigandBDBM21173
Substrate/Competitorn/a
Ki 0.07±n/a nM
CommentsPDSP_739
Citation Lohse, MJKlotz, KNLindenborn-Fotinos, JReddington, MSchwabe, UOlsson, RA 8-Cyclopentyl-1,3-dipropylxanthine (DPCPX)--a selective high affinity antagonist radioligand for A1 adenosine receptors. Naunyn Schmiedebergs Arch Pharmacol336:204-10 (1987) 
 
Adenosine receptor A1
Name:Adenosine receptor A1
Type:Enzyme Catalytic Domain
Mol. Mass.:36602.99
Organism:BOVINE
Description:ADENOSINE 0 BOVINE::P28190
Residue:326
BDBM21173
NameBDBM21173
Synonyms:1,3-dipropyl-8-cyclopentylxanthine CHEMBL183 PD116948 | [3H]DPCPX
Typeradiolabeled ligand
Emp. Form.C16H24N4O2
Mol. Mass.304.3874
SMILESCCCn1c2nc([nH]c2c(=O)n(CCC)c1=O)C1CCCC1