Reaction Details
TargetHrh3 protein
LigandBDBM22914
Substrate/Competitorn/a
Ki 2.1±n/a nM
CommentsPDSP_1847
Citation Arrang, JMGarbarg, MLancelot, JCLecomte, JMPollard, HRobba, MSchunack, WSchwartz, JC Highly potent and selective ligands for a new class H3 of histamine receptor. Invest Radiol0:0-2 (1988) 
 
Hrh3 protein
Name:Hrh3 protein
Type:Enzyme Catalytic Domain
Mol. Mass.:37860.96
Organism:RAT
Description:Q5PPG3
Residue:344
BDBM22914
NameBDBM22914
Synonyms:CHEMBL260374 Thioperamide | US11622967, Compound Thioperamide
TypeSmall organic molecule
Emp. Form.C15H24N4S
Mol. Mass.292.443
SMILESS=C(NC1CCCCC1)N1CCC(CC1)c1cnc[nH]1