Reaction Details
Target5-hydroxytryptamine receptor 2A
LigandBDBM50026053
Substrate/Competitorn/a
Ki 2710±n/a nM
CommentsPDSP_2277
Citation Hall, HSällemark, MJerning, E Effects of remoxipride and some related new substituted salicylamides on rat brain receptors. Acta Pharmacol Toxicol (Copenh)58:61-70 (1986) 
 
5-hydroxytryptamine receptor 2A
Name:5-hydroxytryptamine receptor 2A
Type:G Protein-Coupled Receptor (GPCR)
Mol. Mass.:52852.05
Organism:Rattus norvegicus (rat)
Description:Rat cortex membranes 5-HT2A receptors.
Residue:471
BDBM50026053
NameBDBM50026053
Synonyms:3,5-Dibromo-N-(1-ethyl-pyrrolidin-2-ylmethyl)-2-hydroxy-6-methoxy-benzamide A 36569 | CHEMBL303334
TypeSmall organic molecule
Emp. Form.C15H20Br2N2O3
Mol. Mass.436.139
SMILESCCN1CCC[C@H]1CNC(=O)c1c(O)c(Br)cc(Br)c1OC