Reaction Details
TargetAlpha-1A adrenergic receptor
LigandBDBM50007534
Substrate/Competitorn/a
Ki 5000±n/a nM
CommentsPDSP_2278
Citation Hall, HSällemark, MJerning, E Effects of remoxipride and some related new substituted salicylamides on rat brain receptors. Acta Pharmacol Toxicol (Copenh)58:61-70 (1986) 
 
Alpha-1A adrenergic receptor
Name:Alpha-1A adrenergic receptor
Type:Protein
Mol. Mass.:51620.15
Organism:Rattus norvegicus (Rat)
Description:P43140
Residue:466
BDBM50007534
NameBDBM50007534
Synonyms:3-Bromo-N-((S)-1-ethyl-pyrrolidin-2-ylmethyl)-2-hydroxy-6-methoxy-benzamide A 35043 | CHEMBL283099
TypeSmall organic molecule
Emp. Form.C15H21BrN2O3
Mol. Mass.357.243
SMILESCCN1CCC[C@H]1CNC(=O)c1c(O)c(Br)ccc1OC