Reaction Details
TargetAlpha-1A adrenergic receptor
LigandBDBM50026059
Substrate/Competitorn/a
Ki 1500±n/a nM
CommentsPDSP_2279
Citation Hall, HSällemark, MJerning, E Effects of remoxipride and some related new substituted salicylamides on rat brain receptors. Acta Pharmacol Toxicol (Copenh)58:61-70 (1986) 
 
Alpha-1A adrenergic receptor
Name:Alpha-1A adrenergic receptor
Type:Protein
Mol. Mass.:51620.15
Organism:Rattus norvegicus (Rat)
Description:P43140
Residue:466
BDBM50026059
NameBDBM50026059
Synonyms:3,5-Dichloro-N-(1-ethyl-pyrrolidin-2-ylmethyl)-2-hydroxy-6-methoxy-benzamide A 37843 | CHEMBL23403
TypeSmall organic molecule
Emp. Form.C17H26N2O3
Mol. Mass.306.3999
SMILESCCN1CCC[C@H]1CNC(=O)c1c(O)c(CC)ccc1OC