Reaction Details
TargetAlpha-1A adrenergic receptor
LigandBDBM48320
Substrate/Competitorn/a
Ki>10000±n/a nM
CommentsPDSP_1233
Citation Hall, HSällemark, MJerning, E Effects of remoxipride and some related new substituted salicylamides on rat brain receptors. Acta Pharmacol Toxicol (Copenh)58:61-70 (1986) 
 
Alpha-1A adrenergic receptor
Name:Alpha-1A adrenergic receptor
Type:Protein
Mol. Mass.:51620.15
Organism:Rattus norvegicus (Rat)
Description:P43140
Residue:466
BDBM48320
NameBDBM48320
Synonyms:4-amino-5-chloro-N-[2-(diethylamino)ethyl]-2-methoxy-benzamide;hydrochloride 4-azanyl-5-chloranyl-N-[2-(diethylamino)ethyl]-2-methoxy-benzamide;hydrochloride METOCLOPRAMIDE HYDROCHLORIDE Metochloropramide US11147820, Compound Metoclopramide US9132134, Metoclopramide | cid_23659
TypeSmall organic molecule
Emp. Form.C14H22ClN3O2
Mol. Mass.299.796
SMILESCCN(CC)CCNC(=O)c1cc(Cl)c(N)cc1OC