Reaction Details
TargetAlpha-1A adrenergic receptor
LigandBDBM50026045
Substrate/Competitorn/a
Ki>10000±n/a nM
CommentsPDSP_1593
Citation Hall, HSällemark, MJerning, E Effects of remoxipride and some related new substituted salicylamides on rat brain receptors. Acta Pharmacol Toxicol (Copenh)58:61-70 (1986) 
 
Alpha-1A adrenergic receptor
Name:Alpha-1A adrenergic receptor
Type:Protein
Mol. Mass.:51620.15
Organism:Rattus norvegicus (Rat)
Description:P43140
Residue:466
BDBM50026045
NameBDBM50026045
Synonyms:(R,S)-3-Bromo-N-(1-ethyl-pyrrolidin-2-ylmethyl)-2,6-dimethoxy-benzamide 3-Bromo-N-((R)-1-ethyl-pyrrolidin-2-ylmethyl)-2,6-dimethoxy-benzamide 3-Bromo-N-(1-ethyl-pyrrolidin-2-ylmethyl)-2,6-dimethoxy-benzamide 3-Bromo-N-(1-ethyl-pyrrolidin-2-ylmethyl)-2,6-dimethoxy-benzamide(remoxipride) REMOXIPRIDE
TypeSmall organic molecule
Emp. Form.C16H23BrN2O3
Mol. Mass.371.269
SMILESCCN1CCC[C@H]1CNC(=O)c1c(OC)ccc(Br)c1OC