Reaction Details
TargetAlpha-2C adrenergic receptor
LigandBDBM50026059
Substrate/Competitorn/a
Ki 697±n/a nM
CommentsPDSP_2279
Citation Hall, HSällemark, MJerning, E Effects of remoxipride and some related new substituted salicylamides on rat brain receptors. Acta Pharmacol Toxicol (Copenh)58:61-70 (1986) 
 
Alpha-2C adrenergic receptor
Name:Alpha-2C adrenergic receptor
Type:Enzyme Catalytic Domain
Mol. Mass.:49890.50
Organism:RAT
Description:adrenergic Alpha2 0 RAT::P22086
Residue:458
BDBM50026059
NameBDBM50026059
Synonyms:3,5-Dichloro-N-(1-ethyl-pyrrolidin-2-ylmethyl)-2-hydroxy-6-methoxy-benzamide A 37843 | CHEMBL23403
TypeSmall organic molecule
Emp. Form.C17H26N2O3
Mol. Mass.306.3999
SMILESCCN1CCC[C@H]1CNC(=O)c1c(O)c(CC)ccc1OC