Reaction Details
TargetAlpha-2C adrenergic receptor
LigandBDBM50026044
Substrate/Competitorn/a
Ki 930±n/a nM
CommentsPDSP_2280
Citation Hall, HSällemark, MJerning, E Effects of remoxipride and some related new substituted salicylamides on rat brain receptors. Acta Pharmacol Toxicol (Copenh)58:61-70 (1986) 
 
Alpha-2C adrenergic receptor
Name:Alpha-2C adrenergic receptor
Type:Enzyme Catalytic Domain
Mol. Mass.:49890.50
Organism:RAT
Description:adrenergic Alpha2 0 RAT::P22086
Residue:458
BDBM50026044
NameBDBM50026044
Synonyms:3-Bromo-5-ethyl-N-(1-ethyl-pyrrolidin-2-ylmethyl)-6-hydroxy-2-methoxy-benzamide CHEMBL161668
TypeSmall organic molecule
Emp. Form.C17H25BrN2O3
Mol. Mass.385.296
SMILESCCN1CCC[C@H]1CNC(=O)c1c(O)c(CC)cc(Br)c1OC