Reaction Details
TargetAlpha-2C adrenergic receptor
LigandBDBM22869
Substrate/Competitorn/a
Ki 127±n/a nM
CommentsPDSP_552
Citation Hall, HSällemark, MJerning, E Effects of remoxipride and some related new substituted salicylamides on rat brain receptors. Acta Pharmacol Toxicol (Copenh)58:61-70 (1986) 
 
Alpha-2C adrenergic receptor
Name:Alpha-2C adrenergic receptor
Type:Enzyme Catalytic Domain
Mol. Mass.:49890.50
Organism:RAT
Description:adrenergic Alpha2 0 RAT::P22086
Residue:458
BDBM22869
NameBDBM22869
Synonyms:6-chloro-10-(4-methylpiperazin-1-yl)-2,9-diazatricyclo[9.4.0.0^{3,8}]pentadeca-1,3(8),4,6,10,12,14-heptaene Clozapine US10259786, Clozapine
TypeSmall organic molecule
Emp. Form.C18H19ClN4
Mol. Mass.326.823
SMILESCN1CCN(CC1)C1=c2ccccc2=Nc2ccc(Cl)cc2N1