Reaction Details
TargetAlpha-2C adrenergic receptor
LigandBDBM50002338
Substrate/Competitorn/a
Ki 2280±n/a nM
CommentsPDSP_1849
Citation Hall, HSällemark, MJerning, E Effects of remoxipride and some related new substituted salicylamides on rat brain receptors. Acta Pharmacol Toxicol (Copenh)58:61-70 (1986) 
 
Alpha-2C adrenergic receptor
Name:Alpha-2C adrenergic receptor
Type:Enzyme Catalytic Domain
Mol. Mass.:49890.50
Organism:RAT
Description:adrenergic Alpha2 0 RAT::P22086
Residue:458
BDBM50002338
NameBDBM50002338
Synonyms:(Thioridazine)10-[2-(1-Methyl-piperidin-2-yl)-ethyl]-2-methylsulfanyl-10H-phenothiazine 10-[2-(1-Methyl-piperidin-2-yl)-ethyl]-2-methylsulfanyl-10H-phenothiazine CHEMBL479 MELLARIL-S TP-21 | US9504692, Thioridazine
TypeSmall organic molecule
Emp. Form.C21H26N2S2
Mol. Mass.370.575
SMILESCSc1ccc2Sc3ccccc3N(CCC3CCCCN3C)c2c1