Reaction Details
TargetBeta-2 adrenergic receptor
LigandBDBM50001888
Substrate/Competitorn/a
Ki>10000±n/a nM
CommentsPDSP_513
Citation Hall, HSällemark, MJerning, E Effects of remoxipride and some related new substituted salicylamides on rat brain receptors. Acta Pharmacol Toxicol (Copenh)58:61-70 (1986) 
 
Beta-2 adrenergic receptor
Name:Beta-2 adrenergic receptor
Type:PROTEIN
Mol. Mass.:46896.26
Organism:Rattus norvegicus
Description:ChEMBL_38603
Residue:418
BDBM50001888
NameBDBM50001888
Synonyms:(chloropromazine) [3-(2-Chloro-phenothiazin-10-yl)-propyl]-dimethyl-amine 1-(2-Allyl-phenoxy)-3-isopropylamino-propan-2-ol 3-(2-chloro-10H-phenothiazin-10-yl)-N,N-dimethylpropan-1-amine CHLORPROMAZINE CHLORPROMAZINE HYDROCHLORIDE CHLORPROMAZINE TANNATE PROMAPAR THORAZINE [3-(2-Chloro-phenothiazin-10-yl)-propyl]-dimethyl-amine( Chlorpromazine) chloropromazine | med.21724, Compound 15
TypeSmall organic molecule
Emp. Form.C17H19ClN2S
Mol. Mass.318.864
SMILESCN(C)CCCN1c2ccccc2Sc2ccc(Cl)cc12