Reaction Details
TargetBeta-2 adrenergic receptor
LigandBDBM50005118
Substrate/Competitorn/a
Ki>10000±n/a nM
CommentsPDSP_1584
Citation Hall, HSällemark, MJerning, E Effects of remoxipride and some related new substituted salicylamides on rat brain receptors. Acta Pharmacol Toxicol (Copenh)58:61-70 (1986) 
 
Beta-2 adrenergic receptor
Name:Beta-2 adrenergic receptor
Type:PROTEIN
Mol. Mass.:46896.26
Organism:Rattus norvegicus
Description:ChEMBL_38603
Residue:418
BDBM50005118
NameBDBM50005118
Synonyms:(S)-3,5-Dichloro-N-(1-ethyl-pyrrolidin-2-ylmethyl)-2-hydroxy-6-methoxy-benzamide (S)3,5-Dichloro-N-(1-ethyl-pyrrolidin-2-ylmethyl)-2-hydroxy-6-methoxy-benzamide 3,5-Dichloro-N-(1-ethyl-pyrrolidin-2-ylmethyl)-2-hydroxy-6-methoxy-benzamide 3,5-Dichloro-N-(1-ethyl-pyrrolidin-2-ylmethyl)-2-hydroxy-6-methoxy-benzamide(Raclopride) RACLOPRIDE | Raclopride;3,5-Dichloro-N-(1-ethyl-pyrrolidin-2-ylmethyl)-2-hydroxy-6-methoxy-benzamide
TypeSmall organic molecule
Emp. Form.C15H20Cl2N2O3
Mol. Mass.347.237
SMILESCCN1CCC[C@H]1CNC(=O)c1c(O)c(Cl)cc(Cl)c1OC