Reaction Details
TargetMuscarinic acetylcholine receptor M2
LigandBDBM50007534
Substrate/Competitorn/a
Ki>10000±n/a nM
CommentsPDSP_2278
Citation Hall, HSällemark, MJerning, E Effects of remoxipride and some related new substituted salicylamides on rat brain receptors. Acta Pharmacol Toxicol (Copenh)58:61-70 (1986) 
 
Muscarinic acetylcholine receptor M2
Name:Muscarinic acetylcholine receptor M2
Type:Enzyme Catalytic Domain
Mol. Mass.:51555.53
Organism:RAT
Description:P10980
Residue:466
BDBM50007534
NameBDBM50007534
Synonyms:3-Bromo-N-((S)-1-ethyl-pyrrolidin-2-ylmethyl)-2-hydroxy-6-methoxy-benzamide A 35043 | CHEMBL283099
TypeSmall organic molecule
Emp. Form.C15H21BrN2O3
Mol. Mass.357.243
SMILESCCN1CCC[C@H]1CNC(=O)c1c(O)c(Br)ccc1OC