Reaction Details
TargetMuscarinic acetylcholine receptor M2
LigandBDBM50026044
Substrate/Competitorn/a
Ki>10000±n/a nM
CommentsPDSP_2280
Citation Hall, HSällemark, MJerning, E Effects of remoxipride and some related new substituted salicylamides on rat brain receptors. Acta Pharmacol Toxicol (Copenh)58:61-70 (1986) 
 
Muscarinic acetylcholine receptor M2
Name:Muscarinic acetylcholine receptor M2
Type:Enzyme Catalytic Domain
Mol. Mass.:51555.53
Organism:RAT
Description:P10980
Residue:466
BDBM50026044
NameBDBM50026044
Synonyms:3-Bromo-5-ethyl-N-(1-ethyl-pyrrolidin-2-ylmethyl)-6-hydroxy-2-methoxy-benzamide CHEMBL161668
TypeSmall organic molecule
Emp. Form.C17H25BrN2O3
Mol. Mass.385.296
SMILESCCN1CCC[C@H]1CNC(=O)c1c(O)c(CC)cc(Br)c1OC