Reaction Details
TargetD(1A) dopamine receptor
LigandBDBM50026053
Substrate/Competitorn/a
Ki>10000±n/a nM
CommentsPDSP_2277
Citation Hall, HSällemark, MJerning, E Effects of remoxipride and some related new substituted salicylamides on rat brain receptors. Acta Pharmacol Toxicol (Copenh)58:61-70 (1986) 
 
D(1A) dopamine receptor
Name:D(1A) dopamine receptor
Type:Enzyme Catalytic Domain
Mol. Mass.:49429.75
Organism:RAT
Description:P18901
Residue:446
BDBM50026053
NameBDBM50026053
Synonyms:3,5-Dibromo-N-(1-ethyl-pyrrolidin-2-ylmethyl)-2-hydroxy-6-methoxy-benzamide A 36569 | CHEMBL303334
TypeSmall organic molecule
Emp. Form.C15H20Br2N2O3
Mol. Mass.436.139
SMILESCCN1CCC[C@H]1CNC(=O)c1c(O)c(Br)cc(Br)c1OC