Reaction Details
TargetD(2) dopamine receptor
LigandBDBM50026051
Substrate/Competitorn/a
Ki 1.8±n/a nM
CommentsPDSP_2281
Citation Hall, HSällemark, MJerning, E Effects of remoxipride and some related new substituted salicylamides on rat brain receptors. Acta Pharmacol Toxicol (Copenh)58:61-70 (1986) 
 
D(2) dopamine receptor
Name:D(2) dopamine receptor
Type:G Protein-Coupled Receptor (GPCR)
Mol. Mass.:50931.60
Organism:Rattus norvegicus (rat)
Description:P61169
Residue:444
BDBM50026051
NameBDBM50026051
Synonyms:3,5-Dichloro-N-(1-ethyl-pyrrolidin-2-ylmethyl)-2-hydroxy-6-methoxy-benzamide A 38120 | CHEMBL62429
TypeSmall organic molecule
Emp. Form.C19H30N2O3
Mol. Mass.334.4531
SMILESCCN1CCC[C@H]1CNC(=O)c1c(O)c(CC)cc(CC)c1OC