Reaction Details
TargetHistamine H1 receptor
LigandBDBM50026051
Substrate/Competitorn/a
Ki>10000±n/a nM
CommentsPDSP_2281
Citation Hall, HSällemark, MJerning, E Effects of remoxipride and some related new substituted salicylamides on rat brain receptors. Acta Pharmacol Toxicol (Copenh)58:61-70 (1986) 
 
Histamine H1 receptor
Name:Histamine H1 receptor
Type:Enzyme Catalytic Domain
Mol. Mass.:55716.35
Organism:RAT
Description:HISTAMINE H1 HRH1 RAT::P31390
Residue:486
BDBM50026051
NameBDBM50026051
Synonyms:3,5-Dichloro-N-(1-ethyl-pyrrolidin-2-ylmethyl)-2-hydroxy-6-methoxy-benzamide A 38120 | CHEMBL62429
TypeSmall organic molecule
Emp. Form.C19H30N2O3
Mol. Mass.334.4531
SMILESCCN1CCC[C@H]1CNC(=O)c1c(O)c(CC)cc(CC)c1OC