Reaction Details
TargetHistamine H1 receptor
LigandBDBM21398
Substrate/Competitorn/a
Ki 5020±n/a nM
CommentsPDSP_918
Citation Hall, HSällemark, MJerning, E Effects of remoxipride and some related new substituted salicylamides on rat brain receptors. Acta Pharmacol Toxicol (Copenh)58:61-70 (1986) 
 
Histamine H1 receptor
Name:Histamine H1 receptor
Type:Enzyme Catalytic Domain
Mol. Mass.:55716.35
Organism:RAT
Description:HISTAMINE H1 HRH1 RAT::P31390
Residue:486
BDBM21398
NameBDBM21398
Synonyms:4-[4-(4-Chloro-phenyl)-4-hydroxy-piperidin-1-yl]-1-(4-fluoro-phenyl)-butan-1-one;propionate(HCl) CHEMBL54 Haloperidol | Haloperidol, 1
TypeSmall organic molecule
Emp. Form.C21H23ClFNO2
Mol. Mass.375.864
SMILESOC1(CCN(CCCC(=O)c2ccc(F)cc2)CC1)c1ccc(Cl)cc1