Reaction Details
TargetHistamine H1 receptor
LigandBDBM50026045
Substrate/Competitorn/a
Ki>10000±n/a nM
CommentsPDSP_1593
Citation Hall, HSällemark, MJerning, E Effects of remoxipride and some related new substituted salicylamides on rat brain receptors. Acta Pharmacol Toxicol (Copenh)58:61-70 (1986) 
 
Histamine H1 receptor
Name:Histamine H1 receptor
Type:Enzyme Catalytic Domain
Mol. Mass.:55716.35
Organism:RAT
Description:HISTAMINE H1 HRH1 RAT::P31390
Residue:486
BDBM50026045
NameBDBM50026045
Synonyms:(R,S)-3-Bromo-N-(1-ethyl-pyrrolidin-2-ylmethyl)-2,6-dimethoxy-benzamide 3-Bromo-N-((R)-1-ethyl-pyrrolidin-2-ylmethyl)-2,6-dimethoxy-benzamide 3-Bromo-N-(1-ethyl-pyrrolidin-2-ylmethyl)-2,6-dimethoxy-benzamide 3-Bromo-N-(1-ethyl-pyrrolidin-2-ylmethyl)-2,6-dimethoxy-benzamide(remoxipride) REMOXIPRIDE
TypeSmall organic molecule
Emp. Form.C16H23BrN2O3
Mol. Mass.371.269
SMILESCCN1CCC[C@H]1CNC(=O)c1c(OC)ccc(Br)c1OC