Reaction Details
TargetSigma non-opioid intracellular receptor 1
LigandBDBM112777
Substrate/Competitorn/a
Ki 2000±n/a nM
CommentsPDSP_1363
Citation Korstanje, CSprenkels, RDoods, HNHugtenburg, JGBoddeke, EBatink, HDThoolen, MJVan Zwieten, PA Characterization of flufylline, fluprofylline, ritanserin, butanserin and R 56413 with respect to in-vivo alpha 1-,alpha 2- and 5-HT2-receptor antagonism and in-vitro affinity for alpha 1-,alpha 2- and 5-HT2-receptors: comparison with ketanserin. J Pharm Pharmacol38:374-9 (1986) 
 
Sigma non-opioid intracellular receptor 1
Name:Sigma non-opioid intracellular receptor 1
Type:Protein
Mol. Mass.:25307.17
Organism:Cavia porcellus (Guinea pig)
Description:Q60492
Residue:223
BDBM112777
NameBDBM112777
Synonyms:NORTRIPTYLINE | US8629135, SW-02
TypeSmall organic molecule
Emp. Form.C19H21N
Mol. Mass.263.3767
SMILES[#6]-[#7]-[#6]-[#6]\[#6]=[#6]-1/c2ccccc2-[#6]-[#6]-c2ccccc-12