Reaction Details
TargetSigma non-opioid intracellular receptor 1
LigandBDBM50001028
Substrate/Competitorn/a
Ki 43±n/a nM
CommentsPDSP_1450
Citation Korstanje, CSprenkels, RDoods, HNHugtenburg, JGBoddeke, EBatink, HDThoolen, MJVan Zwieten, PA Characterization of flufylline, fluprofylline, ritanserin, butanserin and R 56413 with respect to in-vivo alpha 1-,alpha 2- and 5-HT2-receptor antagonism and in-vitro affinity for alpha 1-,alpha 2- and 5-HT2-receptors: comparison with ketanserin. J Pharm Pharmacol38:374-9 (1986) 
 
Sigma non-opioid intracellular receptor 1
Name:Sigma non-opioid intracellular receptor 1
Type:Protein
Mol. Mass.:25307.17
Organism:Cavia porcellus (Guinea pig)
Description:Q60492
Residue:223
BDBM50001028
NameBDBM50001028
Synonyms:(+)-PENTAZOCINE (2R,6R,11R)-6,11-Dimethyl-3-(3-methyl-but-2-enyl)-1,2,3,4,5,6-hexahydro-2,6-methano-benzo[d]azocin-8-ol 6,11-Dimethyl-3-(3-methyl-but-2-enyl)-1,2,3,4,5,6-hexahydro-2,6-methano-benzo[d]azocin-8-ol CHEMBL560 PENTAZOCINE (-) Pentazocine,(+/-) Talwin US10736890, Compound TABLE B.8 US9656961, Example 00125 | rel-(2R,6R,11R)-6,11-Dimethyl-3-(3-methyl-but-2-enyl)-1,2,3,4,5,6-hexahydro-2,6-methano-benzo[d]azocin-8-ol
TypeSmall organic molecule
Emp. Form.C19H27NO
Mol. Mass.285.4238
SMILES[#6]-[#6@H]1-[#6@H]-2-[#6]-c3ccc(-[#8])cc3[C@]1([#6])[#6]-[#6]-[#7]-2-[#6]\[#6]=[#6](\[#6])-[#6]