Reaction Details
TargetSigma non-opioid intracellular receptor 1
LigandBDBM50001031
Substrate/Competitorn/a
Ki 625±n/a nM
CommentsPDSP_1715
Citation Korstanje, CSprenkels, RDoods, HNHugtenburg, JGBoddeke, EBatink, HDThoolen, MJVan Zwieten, PA Characterization of flufylline, fluprofylline, ritanserin, butanserin and R 56413 with respect to in-vivo alpha 1-,alpha 2- and 5-HT2-receptor antagonism and in-vitro affinity for alpha 1-,alpha 2- and 5-HT2-receptors: comparison with ketanserin. J Pharm Pharmacol38:374-9 (1986) 
 
Sigma non-opioid intracellular receptor 1
Name:Sigma non-opioid intracellular receptor 1
Type:Protein
Mol. Mass.:25307.17
Organism:Cavia porcellus (Guinea pig)
Description:Q60492
Residue:223
BDBM50001031
NameBDBM50001031
Synonyms:3-Allyl-6,11-dimethyl-1,2,3,4,5,6-hexahydro-2,6-methano-benzo[d]azocin-8-ol SKF 10,047 (+) SKF 10047
TypeSmall organic molecule
Emp. Form.C17H23NO
Mol. Mass.257.3706
SMILESC[C@H]1[C@H]2Cc3ccc(O)cc3[C@@]1(C)CCN2CC=C