Reaction Details
TargetAlpha-1A adrenergic receptor
LigandBDBM36024
Substrate/Competitorn/a
Ki 213±n/a nM
CommentsPDSP_1482
Citation Jones, SBSmith, JMJones, AWBylund, DB Alpha-1 adrenergic receptor binding in aortas from rat and dog: comparison of [3H]prazosin and beta-iodo-[125I]-4-hydroxyphenyl-ethyl-aminomethyl-tetralone. J Pharmacol Exp Ther241:875-81 (1987) Alpha-1A adrenergic receptor
Name:Alpha-1A adrenergic receptor
Type:Enzyme Catalytic Domain
Mol. Mass.:32268.65
Organism:Dog
Description:adrenergic Alpha1 0 Dog::O77621
Residue:295
BDBM36024
NameBDBM36024
Synonyms:(R)-(-)-phenylephrine Phenylephrine,(-)
TypeGuest
Emp. Form.C9H14NO2
Mol. Mass.168.2124
SMILESC[NH2+]C[C@H](O)c1cccc(O)c1