Reaction Details
TargetAlpha-2B adrenergic receptor
LigandBDBM35234
Substrate/Competitorn/a
Ki 122±n/a nM
CommentsPDSP_1348
Citation Murphy, TJBylund, DB Characterization of alpha-2 adrenergic receptors in the OK cell, an opossum kidney cell line. J Pharmacol Exp Ther244:571-8 (1988) Alpha-2B adrenergic receptor
Name:Alpha-2B adrenergic receptor
Type:Enzyme Catalytic Domain
Mol. Mass.:41875.91
Organism:OPOSSUM
Description:adrenergic Alpha2 0 OPOSSUM::O77715
Residue:382
BDBM35234
NameBDBM35234
Synonyms:DL-[7-3H]norepinephrine Noradrenaline,(+) | [3H]NE
Typeradiolabeled ligand
Emp. Form.C8H11NO3
Mol. Mass.169.1778
SMILESNCC(O)c1ccc(O)c(O)c1