Reaction Details
TargetD(1A) dopamine receptor
LigandBDBM50026957
Substrate/Competitorn/a
Ki 474±n/a nM
CommentsPDSP_358
Citation Andersen, PH Comparison of the pharmacological characteristics of [3H]raclopride and [3H]SCH 23390 binding to dopamine receptors in vivo in mouse brain. Eur J Pharmacol146:113-20 (1988) 
 
D(1A) dopamine receptor
Name:D(1A) dopamine receptor
Type:Enzyme
Mol. Mass.:49613.93
Organism:Mus musculus (Mouse)
Description:Q61616
Residue:446
BDBM50026957
NameBDBM50026957
Synonyms:(cis) 2-{4-[3-(2-Trifluoromethyl-thioxanthen-9-ylidene)-propyl]-piperazin-1-yl}-ethanol(Flupentixol) 2-(4-{3-[2-Trifluoromethyl-thioxanthen-(9E)-ylidene]-propyl}-piperazin-1-yl)-ethanol FLUPENTHIXOL, Alpha Flupenthixol | Flupenthixol, Beta
TypeSmall organic molecule
Emp. Form.C23H25F3N2OS
Mol. Mass.434.518
SMILESOCCN1CCN(CC\C=C2/c3ccccc3Sc3ccc(cc23)C(F)(F)F)CC1