Reaction Details
TargetD(2) dopamine receptor
LigandBDBM81777
Substrate/Competitorn/a
Ki 4.1±n/a nM
CommentsPDSP_1365
Citation Andersen, PH Comparison of the pharmacological characteristics of [3H]raclopride and [3H]SCH 23390 binding to dopamine receptors in vivo in mouse brain. Eur J Pharmacol146:113-20 (1988) 
 
D(2) dopamine receptor
Name:D(2) dopamine receptor
Type:Enzyme
Mol. Mass.:50957.64
Organism:Mus musculus (Mouse)
Description:P61168
Residue:444
BDBM81777
NameBDBM81777
Synonyms:CAS_132-66-1 NPA,(+) NSC_8594
TypeSmall organic molecule
Emp. Form.C18H13NO3
Mol. Mass.291.3007
SMILESOC(=O)c1ccccc1C(=O)Nc1cccc2ccccc12